biologia applicata
type: Concept
broader: https://w3id.org/italia/controlled-vocabulary/classifications-for-culture/subject-disciplines/006
notation: 006.014
editorial note: Fonte: Decreto Ministeriale 4 ottobre 2000 [In rete] http://attiministeriali.miur.it/anno-2000/ottobre/dm-04102000.aspx (26 febbraio 2018)
has rank order: 2
definition: Studio integrato della cellula e degli organismi viventi, con particolare riguardo ai meccanismi di base coinvolti nei seguenti processi: espressione, duplicazione e trasmissione dell'informazione genetica, sviluppo, differenziamento, proliferazione cellulare, biogenesi di organelli e strutture cellulari, interazione fra le cellule, basi biologiche del comportamento e dell'evoluzione. Le applicazioni biotecnologiche e di genetica generale e molecolare delle conoscenze nei processi di cui sopra costituiscono un aspetto pertinente al settore. L'apprendimento e l'utilizzo di tutte le tecnologie biologiche avanzate, comprese le tecnologie ricombinanti e l’utilizzo di animali transgenici, è indispensabile al raggiungimento degli obiettivi indicati.
preferred label: experimental biology @en
in scheme: subject-disciplines