farmacologia
type: Concept
definition: Il settore ha l'obiettivo di formare, sul piano didattico e scientifico, competenze professionali specifiche per la conoscenza e lo studio dei farmaci a livello sperimentale preclinico e nell'uomo; studia il meccanismo di azione dei farmaci, medicamenti e tossici, naturali, sintetici e biotecnologici; si occupa di metodologie idonee per la valutazione degli effetti dei farmaci, della farmaco-tossicocinetica, della determinazione e del controllo delle posologie e della rilevazione e valutazione delle reazioni avverse e loro trattamento; valuta inoltre il rapporto rischio/beneficio e costo/beneficio terapeutico degli interventi farmacologici. Il settore comprende come aspetti specifici l’immunofarmacologia e la neuropsicofarmacologia.
has rank order: 2
in scheme: subject-disciplines
preferred label: pharmacology @en
editorial note: Fonte: Decreto Ministeriale 4 ottobre 2000 [In rete] http://attiministeriali.miur.it/anno-2000/ottobre/dm-04102000.aspx (26 febbraio 2018)
broader: https://w3id.org/italia/controlled-vocabulary/classifications-for-culture/subject-disciplines/006
related match: http://thes.bncf.firenze.sbn.it/termine.php
notation: 006.015