microbiologia generale
type: Concept
in scheme: subject-disciplines
notation: 006.020
broader: https://w3id.org/italia/controlled-vocabulary/classifications-for-culture/subject-disciplines/006
has rank order: 2
definition: Il settore studia morfologia, classificazione, genetica, fisiologia e interazioni di tutti i microorganismi, compresi i virus, come modelli semplici per lo studio e la comprensione dei processi biologici. Altri interessi del settore sono la distribuzione in natura dei microorganismi e il ruolo da essi sostenuto nell'ambiente; le interazioni con altri organismi e le modifiche indotte dalla interazione tra microorganismo e ospite; lo sviluppo delle basi cellulari e molecolari della patogenicità microbica e delle forme di difesa dell'ospite; le tecniche microbiologiche di base e applicate, anche in campo biotecnologico; la mutagenesi ambientale.
preferred label: general microbiology @en
editorial note: Fonte: Decreto Ministeriale 4 ottobre 2000 [In rete] http://attiministeriali.miur.it/anno-2000/ottobre/dm-04102000.aspx (26 febbraio 2018)
related match: http://thes.bncf.firenze.sbn.it/termine.php