statistica medica
type: Concept
notation: 007.001
editorial note: Fonte: Decreto Ministeriale 4 ottobre 2000 [In rete] http://attiministeriali.miur.it/anno-2000/ottobre/dm-04102000.aspx (26 febbraio 2018)
has rank order: 2
preferred label: medical statistics @en
broader: https://w3id.org/italia/controlled-vocabulary/classifications-for-culture/subject-disciplines/007
in scheme: subject-disciplines
definition: Il settore si interessa dell'attività scientifica e didattico-formativa nel campo delle metodologie statistiche e statistico-epidemiologiche applicate all’ambito biomedico e clinico, all’antropometria e alla biometria nonché alla programmazione sanitaria e alla organizzazione e gestione dei servizi sanitari.
alternative label: statistica sanitaria
related match: http://thes.bncf.firenze.sbn.it/termine.php