patologia generale
type: Concept
alternative label: patologia medica
broader: 007
definition: Il settore si interessa dell'attività scientifica e didattico-formativa, nonchè dell'attività assistenziale a esse congrua nel campo della genetica medica e degli aspetti diagnostico-clinici a essa correlati compresa la consulenza genetica e i test genetici pertinenti e gli aspetti avanzati di ricerca relativi alle tecnologie ricombinanti in genetica medica.
editorial note: Fonte: Decreto Ministeriale 4 ottobre 2000 [In rete] http://attiministeriali.miur.it/anno-2000/ottobre/dm-04102000.aspx (26 febbraio 2018)
in scheme: subject-disciplines
notation: 007.004
preferred label: experimental medicine and pathophysiology @en
has rank order: 2