anatomia patologica
type: Concept
preferred label: pathology @en
definition: Il settore si interessa dell'attività scientifica e didattico-formativa, nonché dell'attività assistenziale diagnostica a essa congrua nel campo della anatomia e istologia patologica con specifica competenza nella cito-istopatologia, istochimica, immunoistochimica, nella diagnostica anatomo-patologica ultrastrutturale e molecolare e nella anatomia e istologia patologica speciale con particolare riferimento alla patologia cardiovascolare e alla neuropatologia.
notation: 007.008
editorial note: Fonte: Decreto Ministeriale 4 ottobre 2000 [In rete] http://attiministeriali.miur.it/anno-2000/ottobre/dm-04102000.aspx (26 febbraio 2018)
broader: https://w3id.org/italia/controlled-vocabulary/classifications-for-culture/subject-disciplines/007
in scheme: subject-disciplines
related match: http://thes.bncf.firenze.sbn.it/termine.php
has rank order: 2