medicina interna
type: Concept
definition: Il settore si interessa dell'attività scientifica e didattico-formativa, nonché dell'attività assistenziale a essa congrua nel campo della fisiopatologia medica, della semeiotica medica funzionale e strumentale, della metodologia clinica, della medicina basata sulle evidenze, della clinica medica generale e della terapia medica con specifica competenza nella medicina d'urgenza e pronto soccorso, geriatria e gerontologia, allergologia e immunologia clinica; sono inoltre campi di studio la clinica e la patologia metabolica delle vasculopatie, gli aspetti clinici della nutrizione, della medicina dello sport e della medicina termale.
preferred label: internal medicine @en
broader: https://w3id.org/italia/controlled-vocabulary/classifications-for-culture/subject-disciplines/007
editorial note: Fonte: Decreto Ministeriale 4 ottobre 2000 [In rete] http://attiministeriali.miur.it/anno-2000/ottobre/dm-04102000.aspx (26 febbraio 2018)
in scheme: subject-disciplines
notation: 007.009
related match: http://thes.bncf.firenze.sbn.it/termine.php
has rank order: 2