malattie dell'apparato cardiovascolare
type: Concept
preferred label: cardiovascular diseases @en
broader: https://w3id.org/italia/controlled-vocabulary/classifications-for-culture/subject-disciplines/007
definition: Il settore si interessa dell'attività scientifica e didattico-formativa, nonché dell'attività assistenziale a essa congrua nel campo della fisiopatologia, nella semeiotica funzionale e strumentale e nella clinica e terapia farmacologica e strumentale delle malattie dell'apparato cardiovascolare con specifici campi di studio nell’angiologia, nella cardioangiologia medica, nella patologia cardiovascolare dell'età evolutiva e delle attività motorie.
notation: 007.011
related match: http://thes.bncf.firenze.sbn.it/termine.php
has rank order: 2
editorial note: Fonte: Decreto Ministeriale 4 ottobre 2000 [In rete] http://attiministeriali.miur.it/anno-2000/ottobre/dm-04102000.aspx (26 febbraio 2018)
in scheme: subject-disciplines