nefrologia
type: Concept
definition: Il settore si interessa dell'attività scientifica e didattico-formativa, nonché dell'attività assistenziale a essa congrua nel campo della fisiopatologia e clinica delle malattie dell'apparato urinario; gli ambiti di competenza clinica e di ricerca sono la semeiotica funzionale e strumentale, la metodologia clinica e la terapia farmacologica e strumentale in nefrologia con particolare riguardo alla terapia dialitica.
in scheme: subject-disciplines
has rank order: 2
preferred label: nephrology @en
notation: 007.014
editorial note: Fonte: Decreto Ministeriale 4 ottobre 2000 [In rete] http://attiministeriali.miur.it/anno-2000/ottobre/dm-04102000.aspx (26 febbraio 2018)
related match: http://thes.bncf.firenze.sbn.it/termine.php
broader: https://w3id.org/italia/controlled-vocabulary/classifications-for-culture/subject-disciplines/007