reumatologia
type: Concept
preferred label: rheumatology @en
related match: http://thes.bncf.firenze.sbn.it/termine.php
in scheme: subject-disciplines
has rank order: 2
definition: Il settore si interessa dell'attività scientifica e didattico-formativa, nonché dell'attività assistenziale a essa congrua nel campo della fisiopatologia e clinica delle malattie reumatiche; il settore ha competenza nella semeiotica funzionale e strumentale, nella metodologia clinica e nella terapia della patologia reumatologica.
editorial note: Fonte: Decreto Ministeriale 4 ottobre 2000 [In rete] http://attiministeriali.miur.it/anno-2000/ottobre/dm-04102000.aspx (26 febbraio 2018)
notation: 007.016
broader: https://w3id.org/italia/controlled-vocabulary/classifications-for-culture/subject-disciplines/007