chirurgia pediatrica e infantile
type: Concept
alternative label: chirurgia pediatrica
broader: 007
definition: Il settore si interessa dell'attività scientifica e didattico-formativa, nonché dell'attività assistenziale a essa congrua nel campo della chirurgia pediatrica; il settore ha specifiche competenze nella fisiopatologia, nella semeiotica funzionale e strumentale e nella terapia chirurgica tradizionale e mini-invasiva dell’età neonatale e pediatrica.
editorial note: Fonte: Decreto Ministeriale 4 ottobre 2000 [In rete] http://attiministeriali.miur.it/anno-2000/ottobre/dm-04102000.aspx (26 febbraio 2018)
in scheme: subject-disciplines
notation: 007.020
preferred label: paediatric surgery @en
related match: http://thes.bncf.firenze.sbn.it/termine.php
has rank order: 2