chirurgia toracica
type: Concept
broader: 007
definition: Il settore si interessa dell'attività scientifica e didattico-formativa, nonché dell'attività assistenziale a essa congrua nel campo della chirurgia toracica tradizionale e mini-invasiva; il settore ha competenza nella fisiopatologia, metodologia, semeiotica funzionale e strumentale e terapia chirurgica delle patologie dell’apparato respiratorio e delle strutture toraciche, compresa la chirurgia toracica oncologica e la chirurgia toracica d’urgenza e d’emergenza.
editorial note: Fonte: Decreto Ministeriale 4 ottobre 2000 [In rete] http://attiministeriali.miur.it/anno-2000/ottobre/dm-04102000.aspx (26 febbraio 2018)
in scheme: subject-disciplines
notation: 007.021
preferred label: thoracic surgery @en
has rank order: 2