chirurgia vascolare
type: Concept
has rank order: 2
preferred label: vascular surgery @en
notation: 007.022
related match: http://thes.bncf.firenze.sbn.it/termine.php
editorial note: Fonte: Decreto Ministeriale 4 ottobre 2000 [In rete] http://attiministeriali.miur.it/anno-2000/ottobre/dm-04102000.aspx (26 febbraio 2018)
definition: Il settore si interessa dell'attività scientifica e didattico-formativa, nonché dell'attività assistenziale a essa congrua nel campo della chirurgia vascolare tradizionale ed endovascolare; il settore ha specifica competenza nello studio della fisiopatologia, della metodologia, della semeiotica funzionale e strumentale e della terapia nella chirurgia dell’apparato vascolare.
broader: https://w3id.org/italia/controlled-vocabulary/classifications-for-culture/subject-disciplines/007
in scheme: subject-disciplines