pschiatria
type: Concept
related match: http://thes.bncf.firenze.sbn.it/termine.php
in scheme: subject-disciplines
broader: https://w3id.org/italia/controlled-vocabulary/classifications-for-culture/subject-disciplines/007
editorial note: Fonte: Decreto Ministeriale 4 ottobre 2000 [In rete] http://attiministeriali.miur.it/anno-2000/ottobre/dm-04102000.aspx (26 febbraio 2018)
definition: Il settore si interessa dell'attività scientifica e didattico-formativa, nonché dell'attività assistenziale a essa congrua nel campo della psichiatria; sono specifici ambiti di competenza la psicopatologia medica, la psicosomatica, la psicoterapia, la farmacoterapia psichiatrica, gli aspetti psichiatrici della psicologia medica e la psichiatria sociale.
preferred label: psychiatry @en
has rank order: 2
notation: 007.025