neurochirurgia
type: Concept
broader: 007
definition: Il settore si interessa dell'attività scientifica e didattico-formativa, nonché dell'attività assistenziale a essa congrua nel campo della chirurgia del sistema nervoso in età infantile e adulta; sono specifici campi di competenza la semeiotica funzionale e strumentale, la metodologia e la terapia tradizionale e mininvasiva in neurochirurgia e neurotraumatologia.
editorial note: Fonte: Decreto Ministeriale 4 ottobre 2000 [In rete] http://attiministeriali.miur.it/anno-2000/ottobre/dm-04102000.aspx (26 febbraio 2018)
in scheme: subject-disciplines
notation: 007.027
preferred label: neurosurgery @en
has rank order: 2