malattie odontostomatologiche
type: Concept
broader: https://w3id.org/italia/controlled-vocabulary/classifications-for-culture/subject-disciplines/007
notation: 007.028
editorial note: Fonte: Decreto Ministeriale 4 ottobre 2000 [In rete] http://attiministeriali.miur.it/anno-2000/ottobre/dm-04102000.aspx (26 febbraio 2018)
has rank order: 2
definition: Il settore si interessa dell'attività scientifica e didattico-formativa, nonché dell'attività assistenziale a essa congrua nel campo della fisiopatologia e clinica delle malattie dell'apparato odontostomatologico in età pediatrica e adulta e dell’odontoiatria preventiva e di comunità; il settore ha specifica competenza nei campi della chirurgia orale, dell’odontoiatria restaurativa, ortognatodonzia, gnatologia clinica, pedodonzia, parodontologia e implantologia e nello studio delle protesi dentarie e della riabilitazione implantoprotesica ed odontostomatologica e dei materiali dentari.
preferred label: oral diseases and dentistry @en
in scheme: subject-disciplines