malattie apparato visivo
type: Concept
editorial note: Fonte: Decreto Ministeriale 4 ottobre 2000 [In rete] http://attiministeriali.miur.it/anno-2000/ottobre/dm-04102000.aspx (26 febbraio 2018)
alternative label: malattie degli occhi
notation: 007.030
in scheme: subject-disciplines
has rank order: 2
preferred label: eye diseases @en
definition: Il settore si interessa dell'attività scientifica e didattico-formativa, nonché dell'attività assistenziale a essa congrua nel campo della fisiopatologia e clinica delle malattie dell'apparato visivo in età pediatrica e adulta; il settore ha specifica competenza nella semeiotica funzionale e strumentale, nella metodologia e nella terapia medica e chirurgica in oftalmologia e la neuroftalmologia.
related match: http://thes.bncf.firenze.sbn.it/termine.php
broader: https://w3id.org/italia/controlled-vocabulary/classifications-for-culture/subject-disciplines/007