otorinolaringoiatria
type: Concept
related match: http://thes.bncf.firenze.sbn.it/termine.php
has rank order: 2
editorial note: Fonte: Decreto Ministeriale 4 ottobre 2000 [In rete] http://attiministeriali.miur.it/anno-2000/ottobre/dm-04102000.aspx (26 febbraio 2018)
notation: 007.031
in scheme: subject-disciplines
broader: https://w3id.org/italia/controlled-vocabulary/classifications-for-culture/subject-disciplines/007
preferred label: otorhinolaryngology @en
definition: Il settore si interessa dell'attività scientifica e didattico-formativa, nonché dell'attività assistenziale a essa congrua nel campo della fisiopatologia e clinica delle malattie otorinolaringoiatriche in età pediatrica e adulta con specifica competenza nella semeiotica funzionale e strumentale, nella metodologia e nella terapia medica e chirurgica in otorinolaringoiatria e in otoneuroradiologia.