neuroradiologia
type: Concept
broader: https://w3id.org/italia/controlled-vocabulary/classifications-for-culture/subject-disciplines/007
notation: 007.038
editorial note: Fonte: Decreto Ministeriale 4 ottobre 2000 [In rete] http://attiministeriali.miur.it/anno-2000/ottobre/dm-04102000.aspx (26 febbraio 2018)
has rank order: 2
definition: Il settore si interessa dell'attività scientifica e didattico-formativa, nonché dell'attività assistenziale a essa congrua nel campo della neuroradiologia con specifica competenza nell’anatomia neuroradiologica clinica, nella neuroradiologia generale e interventistica e nella diagnostica per immagini del sistema nervoso.
preferred label: neuroradiology @en
in scheme: subject-disciplines