pediatria generale e specialistica
type: Concept
preferred label: general and subspecialty paediatrics @en
has rank order: 2
definition: Il settore si interessa dell’attività scientifica e didattico-formativa, nonché dell’attività assistenziale a essa congrua nel campo della fisiopatologia, della semeiotica medica funzionale e strumentale e della metodologia clinica e della terapia nell’età evolutiva con specifica competenza nella pediatria preventiva e sociale, nelle patologie pediatriche generali e specialistiche di interesse medico dal neonato all’adolescente compreso e negli aspetti pediatrici delle attività motorie e della medicina di comunità in età pediatrica.
editorial note: Fonte: Decreto Ministeriale 4 ottobre 2000 [In rete] http://attiministeriali.miur.it/anno-2000/ottobre/dm-04102000.aspx (26 febbraio 2018)
notation: 007.039
in scheme: subject-disciplines
alternative label: pediatria
related match: http://thes.bncf.firenze.sbn.it/termine.php
broader: https://w3id.org/italia/controlled-vocabulary/classifications-for-culture/subject-disciplines/007