ginecologia e ostetricia
type: Concept
alternative label: ginecologia
alternative label: ostetricia
broader: 007
definition: Il settore si interessa dell'attività scientifica e didattico-formativa, nonché dell'attività assistenziale a essa congrua nel campo della fisiopatologia e clinica dell'apparato genitale femminile; sono specifici ambiti di competenza la semeiotica funzionale e strumentale, la metodologia clinica, la terapia e la chirurgia tradizionale e mini-invasiva in ginecologia e ostetricia e gli aspetti ginecologici della endocrinologia, della fisiopatologia della riproduzione umana, della oncologica e della medicina dell'età prenatale.
editorial note: Fonte: Decreto Ministeriale 4 ottobre 2000 [In rete] http://attiministeriali.miur.it/anno-2000/ottobre/dm-04102000.aspx (26 febbraio 2018)
in scheme: subject-disciplines
notation: 007.041
preferred label: obstetrics and gynaecology @en
related match: http://thes.bncf.firenze.sbn.it/termine.php
has rank order: 2