igiene generale e applicata
type: Concept
broader: 007
definition: Il settore si interessa dell'attività scientifica e didattico-formativa, nonché dell'attività assistenziale a essa congrua nel campo dell’igiene generale e applicata; il settore ha specifica competenza nel campo dell’igiene applicata all'ambiente, ai luoghi di lavoro, all’igiene scolastica, all’igiene degli alimenti e della nutrizione, della medicina di comunità, della medicina preventiva, riabilitativa e sociale, dell’epidemiologia, della sanità pubblica, della programmazione, organizzazione e gestione dei servizi sanitari e dell’educazione sanitaria.
editorial note: Fonte: Decreto Ministeriale 4 ottobre 2000 [In rete] http://attiministeriali.miur.it/anno-2000/ottobre/dm-04102000.aspx (26 febbraio 2018)
in scheme: subject-disciplines
notation: 007.044
preferred label: hygiene and public health @en
has rank order: 2