medicina del lavoro
type: Concept
broader: 007
definition: Il settore si interessa dell'attività scientifica e didattico-formativa, nonché dell'attività assistenziale a essa congrua nel campo della medicina del lavoro e della medicina preventiva in ambito lavorativo; sono specifiche competenze del settore l’igiene, l’epidemiologia, la tossicologia e l’ergonomia occupazionali.
editorial note: Fonte: Decreto Ministeriale 4 ottobre 2000 [In rete] http://attiministeriali.miur.it/anno-2000/ottobre/dm-04102000.aspx (26 febbraio 2018)
in scheme: subject-disciplines
notation: 007.046
preferred label: occupational medicine @en
related match: http://thes.bncf.firenze.sbn.it/termine.php
has rank order: 2