scienze infermieristiche generali, cliniche e pediatriche
type: Concept
broader: https://w3id.org/italia/controlled-vocabulary/classifications-for-culture/subject-disciplines/007
notation: 007.047
editorial note: Fonte: Decreto Ministeriale 4 ottobre 2000 [In rete] http://attiministeriali.miur.it/anno-2000/ottobre/dm-04102000.aspx (26 febbraio 2018)
has rank order: 2
definition: Il settore si interessa dell'attività scientifica e didattico-formativa, nonché dell'attività assistenziale a essa congrua nel campo della infermieristica generale, pediatrica e neonatale; sono ambiti di competenza del settore la metodologia della ricerca in campo infermieristico, la teoria dell'assistenza infermieristica, l’infermieristica clinica, preventiva e di comunità, l’infermieristica dell'area critica e dell'emergenza e la metodologia e organizzazione della professione.
preferred label: nursing sciences: general, clinical and paediatric @en
in scheme: subject-disciplines