scienze infermieristiche ostetrico-ginecologiche
type: Concept
broader: 007
definition: Il settore si interessa dell'attività scientifica e didattico-formativa, nonché dell'attività assistenziale a essa congrua nel campo della infermieristica speciale ostetrica e ginecologica; il settore ha specifici ambiti di competenza nella teoria e metodologia della ricerca e dell'assistenza infermieristica ostetrica e nell’assistenza speciale ostetrico-neonatale e nella metodologia e organizzazione della professione del settore.
editorial note: Fonte: Decreto Ministeriale 4 ottobre 2000 [In rete] http://attiministeriali.miur.it/anno-2000/ottobre/dm-04102000.aspx (26 febbraio 2018)
in scheme: subject-disciplines
notation: 007.049
preferred label: midwifery @en
has rank order: 2