scienze tecniche dietetiche applicate
type: Concept
broader: 007
definition: Il settore si interessa dell’attività scientifica e didattico-formativa, nonché dell’attività assistenziale a essa congrua nel campo delle scienze dell’alimentazione e delle tecniche dietetiche; sono campi di competenza le tematiche di ricerca inerenti l’alimentazione umana, i principi generali di dietetica e di fisiopatologia endocrino-metabolica applicati alla dietetica e la metodologia ed organizzazione della professione.
editorial note: Fonte: Decreto Ministeriale 4 ottobre 2000 [In rete] http://attiministeriali.miur.it/anno-2000/ottobre/dm-04102000.aspx (26 febbraio 2018)
in scheme: subject-disciplines
notation: 007.051
preferred label: food sciences and dietetics @en
has rank order: 2