scienze tecniche mediche applicate
type: Concept
broader: https://w3id.org/italia/controlled-vocabulary/classifications-for-culture/subject-disciplines/007
notation: 007.052
editorial note: Fonte: Decreto Ministeriale 4 ottobre 2000 [In rete] http://attiministeriali.miur.it/anno-2000/ottobre/dm-04102000.aspx (26 febbraio 2018)
has rank order: 2
definition: Il settore si interessa dell'attività scientifica e didattico-formativa, nonché dell'attività assistenziale a essa congrua nel campo delle scienze tecniche dietetiche; sono campi di competenza i principi generali di dietetica e i principi di fisiopatologia endocrino-metabolica applicati alla dietetica e la metodologia e organizzazione della professione.
preferred label: applied medical techniques @en
in scheme: subject-disciplines