economia ed estimo rurale
type: Concept
related match: http://thes.bncf.firenze.sbn.it/termine.php
in scheme: subject-disciplines
broader: https://w3id.org/italia/controlled-vocabulary/classifications-for-culture/subject-disciplines/008
editorial note: Fonte: Decreto Ministeriale 4 ottobre 2000 [In rete] http://attiministeriali.miur.it/anno-2000/ottobre/dm-04102000.aspx (26 febbraio 2018)
notation: 008.001
preferred label: agricultural economics and rural appraisal @en
definition: Il settore raggruppa i temi di ricerca inerenti agli aspetti economici, politici, gestionali ed estimativi della produzione, trasformazione, distribuzione, mercato e consumo dei prodotti del settore primario (agricoltura, selvicoltura e pesca) e delle agro-biotecnologie, ai loro rapporti con le altre componenti del sistema socioeconomico e ambientale e agli aspetti economici della valutazione di impatto ambientale. Le competenze formative del settore comprendono l’economia e la politica agraria, montana, forestale e agroindustriale a livello di territorio rurale e delle sue risorse, delle aziende e dei mezzi tecnici impiegati, ivi comprese le agrobiotecnologie, gli aspetti economici della pianificazione e gestione del territorio e dell’ambiente rurale, le interazioni tra sistemi agricoli e sviluppo economico, l’estimo rurale e ambientale.
alternative label: estimo rurale
has rank order: 2