assestamento forestale e selvicoltura
type: Concept
editorial note: Fonte: Decreto Ministeriale 4 ottobre 2000 [In rete] http://attiministeriali.miur.it/anno-2000/ottobre/dm-04102000.aspx (26 febbraio 2018)
broader: https://w3id.org/italia/controlled-vocabulary/classifications-for-culture/subject-disciplines/008
related match: http://thes.bncf.firenze.sbn.it/termine.php
in scheme: subject-disciplines
has rank order: 2
preferred label: forest management and silviculture @en
notation: 008.006
definition: Il settore raggruppa i temi di ricerca riguardanti la biologia, l’ecologia e l’ecofisiologia delle specie forestali e selvicolturali, la struttura, funzionalità e produttività degli ecosistemi forestali, ivi incluse le foreste a finalità multipla e i soprasuoli con finalità produttive, e integra le conoscenze acquisite nel definire principi e mettere a punto strategie e metodi di monitoraggio, inventario, misura, trattamenti selvicolturali e la pianificazione gestionale dei boschi e del territorio forestale, al fine di migliorare la sostenibilità delle diverse funzioni ecologiche e produttive. Il settore ha competenze formative che riguardano l’ecologia ed ecofisiologia dei sistemi forestali, gli indirizzi e le tecniche per la selvicoltura generale, industriale, speciale, urbana, le alberature, l’assestamento forestale, la dendrologia e dendrometria, la pianificazione ecologica del territorio forestale, ivi inclusa quella dei parchi naturali e delle aree protette, le biotecnologie, la vivaistica e i rimboschimenti, la piantagione e la coltivazione di nuovi boschi, di colture forestali da legno, di coperture arboree per aree urbane o a protezione e ripristino di terreni marginali e degradati, la prevenzione e la lotta agli incendi boschivi.
alternative label: selvicoltura