genetica agraria
type: Concept
alternative label: genetica vegetale
broader: 008
definition: Il settore raggruppa i temi di ricerca riguardanti la struttura, le funzioni, l'espressione e l'ereditarietà dei geni negli organismi procarioti ed eucarioti d'interesse agrario - ivi compresi la frequenza, distribuzione e dinamica dei polimorfismi nelle popolazioni costituenti risorse genetiche - e integra le conoscenze acquisite con gli elementi necessari per delineare principi e mettere a punto strategie e metodologie di interventi genetici e biotecnologici volti a promuovere un esercizio agricolo corretto, la fruizione sostenibile di derrate e prodotti agricoli e forestali di qualità e la diversificazione e valorizzazione dei prodotti finiti. Le competenze formative riguardano la genetica, citognetica, mutagenesi, differenziamento, biometria, biotecnologie, colture in vitro e manipolazioni cellulari di organismi di interesse agrario e forestale, la teoria della selezione, le risorse genetiche, i metodi di miglioramento genetico e la genetica sementiera e vivaistica.
editorial note: Fonte: Decreto Ministeriale 4 ottobre 2000 [In rete] http://attiministeriali.miur.it/anno-2000/ottobre/dm-04102000.aspx (26 febbraio 2018)
in scheme: subject-disciplines
notation: 008.008
preferred label: agricultural genetics @en
related match: http://thes.bncf.firenze.sbn.it/termine.php
has rank order: 2