idraulica agraria e sistemazioni idraulico-forestali
type: Concept
notation: 008.009
related match: http://thes.bncf.firenze.sbn.it/termine.php
broader: https://w3id.org/italia/controlled-vocabulary/classifications-for-culture/subject-disciplines/008
editorial note: Fonte: Decreto Ministeriale 4 ottobre 2000 [In rete] http://attiministeriali.miur.it/anno-2000/ottobre/dm-04102000.aspx (26 febbraio 2018)
has rank order: 2
preferred label: agricultural hydraulics and watershed protection @en
alternative label: idraulica agraria
definition: Il settore raggruppa i temi di ricerca riguardanti l’idrologia del suolo e dei piccoli bacini e i processi di erosione, e integra i risultati con le conoscenze necessarie per la progettazione di opere di sistemazione idraulico forestale e di captazione, trasporto e tutela dell'acqua per uso agricolo, la definizione e messa a punto di criteri per la gestione delle risorse idriche territoriali. Le competenze formative riguardano l'idraulica agraria e forestale, l'idrologia e difesa del suolo, le tecniche di ingegneria naturalistica e le sistemazioni idraulico-forestali, la tutela ambientale e la gestione integrata dei piccoli bacini, le risorse idriche nei sistemi agroforestali, l’approvigionamento e smaltimento delle acque, gli impianti idrici per l'azienda agraria e le industrie agroindustriali, l’irrigazione e il drenaggio.
in scheme: subject-disciplines