meccanica agraria
type: Concept
broader: https://w3id.org/italia/controlled-vocabulary/classifications-for-culture/subject-disciplines/008
notation: 008.010
editorial note: Fonte: Decreto Ministeriale 4 ottobre 2000 [In rete] http://attiministeriali.miur.it/anno-2000/ottobre/dm-04102000.aspx (26 febbraio 2018)
has rank order: 2
definition: Il settore raggruppa i temi di ricerca inerenti alle macchine e agli impianti per il comparto agricolo e forestale, per il verde e per l'agroindustria, con particolare riguardo ai loro aspetti progettuali, costruttivi, operativi, funzionali, gestionali e ambientali, antinfortunistici ed ergonomici, all'automazione e controllo dei processi e all'utilizzazione di fonti energetiche convenzionali e non convenzionali. Le competenze formative riguardano la meccanica e meccanizzazione agricola e forestale, la modellistica, le macchine e gli impianti per l'agricoltura, per il verde e per le industrie agro-alimentari e del legno, per l'utilizzazione delle biomasse e per il recupero dei reflui agricoli e agro-industriali, l’energetica nei sistemi agro-forestali e agro-industriali, l’automazione, il controllo, la sicurezza ed ergonomia delle macchine e degli impianti per i comparti agricolo, forestale e agro-industriale.
preferred label: agricultural machinery and mechanization @en
in scheme: subject-disciplines