entomologia generale e applicata
type: Concept
editorial note: Fonte: Decreto Ministeriale 4 ottobre 2000 [In rete] http://attiministeriali.miur.it/anno-2000/ottobre/dm-04102000.aspx (26 febbraio 2018)
in scheme: subject-disciplines
preferred label: general and applied entomology @en
has rank order: 2
related match: http://thes.bncf.firenze.sbn.it/termine.php
definition: Il settore raggruppa i temi di ricerca inerenti alla morfologia, fisiologia, sistematica, ecologia ed etologia degli organismi animali di interesse agrario, forestale, urbano, merceologico e medico-veterinario, gli artropodi e i nematodi, alle relative interazioni biocenotiche e integra le conoscenze nella messa a punto di strategie e metodi di controllo delle specie dannose ivi compresi i vertebrati, la protezione e il potenziamento di quelle utili. Le competenze formative riguardano l’entomologia generale e applicata, agraria, forestale, urbana e delle derrate, medico-veterinarie, l’apidologia e sericoltura, la zoologia generale agraria e applicata, le interazioni biocenotiche, il controllo biologico e integrato degli animali infestanti, la parassitologia agraria e medico veterinaria, le biotecnologie applicate agli artropodi, la progettazione e gestione di bio-fabbriche.
alternative label: entomologia agraria
notation: 008.012
broader: https://w3id.org/italia/controlled-vocabulary/classifications-for-culture/subject-disciplines/008