patologia vegetale
type: Concept
editorial note: Fonte: Decreto Ministeriale 4 ottobre 2000 [In rete] http://attiministeriali.miur.it/anno-2000/ottobre/dm-04102000.aspx (26 febbraio 2018)
preferred label: plant pathology @en
in scheme: subject-disciplines
broader: https://w3id.org/italia/controlled-vocabulary/classifications-for-culture/subject-disciplines/008
related match: http://thes.bncf.firenze.sbn.it/termine.php
has rank order: 2
definition: Il settore scientifico disciplinare "Patologia Vegetale" costituisce un insieme di temi di ricerca che affrontano, dal punto di vista morfologico, fisiologico, epidemiologico, le malattie delle piante e dei prodotti vegetali causate da agenti biotici (virus, procarioti, funghi, fanerogame parassite) e da fattori abiotici, approfondendo anche le basi anatomiche e fisiologiche dei meccanismi di aggressione dei patogeni e di resistenza delle piante, e integra le conoscenze acquisite nell’ideazione e messa a punto di mezzi diagnostici, strategie e tecniche di difesa rispettose dell'ambiente. Le competenze formative riguardano la micologia e batteriologia fitopatologiche, la virologia vegetale, la patologia e fisiopatologia delle piante agrarie e forestali e dei loro prodotti, le malattie non parassitarie, la fitoiatria, la difesa biologica e integrata dalle malattie e le biotecnologie fitopatologiche.
notation: 008.013