chimica agraria
type: Concept
broader: https://w3id.org/italia/controlled-vocabulary/classifications-for-culture/subject-disciplines/008
definition: Il settore raggruppa le tematiche di ricerca riguardanti gli aspetti chimici, biochimici, fisiologici ed ecologici del sistema suolo-acqua-pianta-atmosfera, con particolare attenzione alle interazioni che vi si sviluppano, ai processi di accumulo, mobilizzazione e assorbimento di specie chimiche, endogene ed esogene, utili o dannose, in condizioni ottimali e di stress, all'approccio biotecnologico volto a individuare mezzi tecnici innovativi per la regolazione dei processi atti a migliorare la resa e la qualità della produzione, preservare, migliorare e ripristinare la fertilità del suolo. Le competenze formative sono inerenti alla chimica, biochimica e fertilità del suolo, alla biochimica e fisiologia delle piante coltivate e dei loro prodotti, anche in post-raccolta, ai fitofarmaci, fitoregolatori e loro residui, all’uso e riciclo delle biomasse agrarie e forestali e alla protezione dell'ambiente agroforestale.
editorial note: Fonte: Decreto Ministeriale 4 ottobre 2000 [In rete] http://attiministeriali.miur.it/anno-2000/ottobre/dm-04102000.aspx (26 febbraio 2018)
notation: 008.014
in scheme: subject-disciplines
related match: http://thes.bncf.firenze.sbn.it/termine.php
has rank order: 2
preferred label: agricultural chemistry @en