pedologia
type: Concept
broader: 008
definition: Il settore raggruppa i temi di ricerca inerenti al sistema suolo quale risultato delle azioni e interazioni dei fattori ambientali e antropici che ne condizionano la dinamica evolutiva, e delinea principi e metodi di classificazione, valutazione e distribuzione spaziale e cartografica dei suoli. Le competenze formative riguardano la pedologia, la genesi, geografia, classificazione e cartografia dei suoli, la pedoarcheologia, i suoli antropici e la ricostruzione dei suoli, le tecniche e metodi di valutazione dei suoli.
editorial note: Fonte: Decreto Ministeriale 4 ottobre 2000 [In rete] http://attiministeriali.miur.it/anno-2000/ottobre/dm-04102000.aspx (26 febbraio 2018)
in scheme: subject-disciplines
notation: 008.015
preferred label: pedology @en
related match: pedologia
related match: http://thes.bncf.firenze.sbn.it/termine.php
has rank order: 2