scienze e tecnologie alimentari
type: Concept
preferred label: food science and technology @en
has rank order: 2
editorial note: Fonte: Decreto Ministeriale 4 ottobre 2000 [In rete] http://attiministeriali.miur.it/anno-2000/ottobre/dm-04102000.aspx (26 febbraio 2018)
in scheme: subject-disciplines
definition: Il settore riunisce i temi di ricerca di natura biologica, fisica e tecnologica che sono alla base dei processi e degli impianti della filiera agroalimentare, dall'approvvigionamento delle materie prime alla commercializzazione dei prodotti, lo sviluppo di nuovi prodotti e nuovi processi, la gestione e il controllo della qualità e della sicurezza dei prodotti. Le competenze formative riguardano i processi della tecnologia alimentare, la tecnologia del condizionamento e della distribuzione dei prodotti, la detergenza e la sanificazione degli impianti, le analisi chimiche e la valutazione delle proprietà fisiche e sensoriali dei prodotti, la gestione della qualità dei prodotti, il trattamento dei reflui dell'industria alimentare.
broader: https://w3id.org/italia/controlled-vocabulary/classifications-for-culture/subject-disciplines/008
notation: 008.016
alternative label: alimentazione <tecnologie>
related match: http://thes.bncf.firenze.sbn.it/termine.php