microbiologia agraria
type: Concept
preferred label: agricultural microbiology @en
in scheme: subject-disciplines
editorial note: Fonte: Decreto Ministeriale 4 ottobre 2000 [In rete] http://attiministeriali.miur.it/anno-2000/ottobre/dm-04102000.aspx (26 febbraio 2018)
related match: http://thes.bncf.firenze.sbn.it/termine.php
has rank order: 2
definition: Il settore raccoglie i temi di ricerca inerenti fisiologia, genetica, caratterizzazione, utilizzazione e controllo dei microorganismi degli ecosistemi naturali, agrari, forestali, agroalimentari degli animali e delle acque e nelle relative filiere. Le competenze formative riguardano la biologia dei microorganismi, la biodiversità e le risorse microbiche di interesse agro-alimentare, le biotecnologie microbiche, la microbiologia applicata ai settori agro-alimentare, agro-industriale e ambientale, le tecniche microbiologiche, la storia e la didattica della microbiologia.
notation: 008.017
broader: https://w3id.org/italia/controlled-vocabulary/classifications-for-culture/subject-disciplines/008