nutrizione e alimentazione animale
type: Concept
broader: https://w3id.org/italia/controlled-vocabulary/classifications-for-culture/subject-disciplines/008
notation: 008.019
editorial note: Fonte: Decreto Ministeriale 4 ottobre 2000 [In rete] http://attiministeriali.miur.it/anno-2000/ottobre/dm-04102000.aspx (26 febbraio 2018)
has rank order: 2
definition: Il settore raggruppa le tematiche di ricerca inerenti all'alimentazione degli animali in produzione zootecnica e d'affezione, all'utilizzazione digestiva e metabolica dei principi nutritivi, alle caratteristiche fisiche, chimiche e nutrizionali degli alimenti per gli animali, delinea principi di alimentazione animale e mette a punto biotecnologie e agrotecnologie alimentari e mangimistiche che abbiano una corretta influenza sul rendimento produttivo, sul benessere degli animali e sulle caratteristiche dei prodotti zootecnici con riferimento alla loro rispondenza alle esigenze tecnologiche, nutrizionali e di salubrità del consumatore e ai rapporti che intercorrono fra alimentazione degli animali e inquinamento ambientale. Le competenze formative riguardano gli alimenti zootecnici, la dietetica e l’igiene alimentare negli allevamenti animali, compresi quelli acquatici, le metodologie e biotecnologie applicate all'alimentazione animale, la nutrizione e alimentazione animale, la tecnica mangimistica e l’utilizzazione dei sottoprodotti.
preferred label: animal nutrition and feeding @en
in scheme: subject-disciplines