zootecnica speciale
type: Concept
broader: https://w3id.org/italia/controlled-vocabulary/classifications-for-culture/subject-disciplines/008
notation: 008.020
editorial note: Fonte: Decreto Ministeriale 4 ottobre 2000 [In rete] http://attiministeriali.miur.it/anno-2000/ottobre/dm-04102000.aspx (26 febbraio 2018)
has rank order: 2
definition: Il settore raggruppa le tematiche di ricerca inerenti alla valutazione morfo-funzionale, etologica, riproduttiva delle diverse specie, comprese quelle d'affezione e a carattere faunistico venatorio, e integrano le conoscenze per mettere a punto biotecnologie e agrotecnologie di allevamento, in diversi ambienti e sistemi zootecnici, nel rispetto dell'igiene e dell'ambiente, del benessere animale e nella tutela della qualità dei prodotti. Le competenze formative riguardano la valutazione morfo-funzionale degli animali in produzione zootecnica, l’etologia, ecologia e fisio-climatologia zootecnica, le metodologie e biotecnologie applicate all'allevamento animale, la zootecnica speciale, la valutazione della qualità dei prodotti d’origine animale, gli approvvigionamenti annonari e l’industria dei prodotti zootecnici.
preferred label: animal science @en
in scheme: subject-disciplines