zoocolture
type: Concept
broader: https://w3id.org/italia/controlled-vocabulary/classifications-for-culture/subject-disciplines/008
notation: 008.021
editorial note: Fonte: Decreto Ministeriale 4 ottobre 2000 [In rete] http://attiministeriali.miur.it/anno-2000/ottobre/dm-04102000.aspx (26 febbraio 2018)
has rank order: 2
definition: Il settore raggruppa le tematiche di ricerca inerenti alle specie avicole, cunicole e acquatiche, caratterizzate dalla brevità del ciclo biologico e industrializzazione dei processi di produzione, trasformazione e commercializzazione dei prodotti, e mette a punto sistemi e tecniche di allevamento, che diano prodotti quali-quantitativamente elevati. Le competenze formative riguardano la fisio-climatologia zootecnica, l’acquacoltura, l’allevamento dell'avifauna, di animali da laboratorio e da pelliccia, l’avicoltura, la coniglicoltura e le zoocolture.
preferred label: aquaculture, poultry and rabbit science @en
in scheme: subject-disciplines