anatomia degli animali domestici
type: Concept
broader: https://w3id.org/italia/controlled-vocabulary/classifications-for-culture/subject-disciplines/009
notation: 009.001
editorial note: Fonte: Decreto Ministeriale 4 ottobre 2000 [In rete] http://attiministeriali.miur.it/anno-2000/ottobre/dm-04102000.aspx (26 febbraio 2018)
has rank order: 2
definition: Il settore raggruppa discipline che studiano la morfologia e la biologia degli animali di interesse medico veterinario, dal livello macroscopico a quello molecolare, focalizzando le conoscenze sull’organizzazione e sui meccanismi morfogenetici e teratogenici nel corso dello sviluppo e sulle funzioni cellulari e approfondendo la morfologia anche sotto gli aspetti comparativo, topografico e applicativo. Le competenze formative riguardano la biologia dei vertebrati di interesse veterinario, l’istologia, l’embriologia e la teratologia generale e speciale veterinaria, l'anatomia, la fisiologia e la morfologia veterinaria, l’anatomia topografica veterinaria, l’anatomia sistematica e comparata delle specie di interesse veterinario, le metodologie anatomoistologiche veterinarie.
preferred label: veterinary anatomy @en
in scheme: subject-disciplines