patologia generale e anatomia patologica veterinaria
type: Concept
in scheme: subject-disciplines
preferred label: veterinary pathology @en
definition: Il settore comprende le discipline e i temi di ricerca inerenti all’eziopatogenesi delle malattie, secondo l’impostazione propria della patologia generale veterinaria e comparata, i mutamenti metabolici primari e le alterazioni funzionali di base di organi e apparati secondo l’impostazione propria della fisiopatologia e dell’immunopatologia generale, i quadri macroscopici e microscopici (istocitologico-istocitochimici, immunoistocitochimici, ultrastrutturali) delle patologie di sistema e delle singole entità nosologiche pertinenti all’anatomia patologica speciale, le biotecnologie finalizzate allo studio eziopatogenetico di entità nosologiche degli animali d’affezione, da reddito, selvatici e da laboratorio, ricomprese anche nel settore dell’oncologia, della ittiopatologia, della patologia ambientale e della teratologia, le tecnologie diagnostiche relative alle autopsie degli animali domestici, selvatici, acquatici e da laboratorio.
broader: https://w3id.org/italia/controlled-vocabulary/classifications-for-culture/subject-disciplines/009
alternative label: patologia veterinaria
notation: 009.003
has rank order: 2
editorial note: Fonte: Decreto Ministeriale 4 ottobre 2000 [In rete] http://attiministeriali.miur.it/anno-2000/ottobre/dm-04102000.aspx (26 febbraio 2018)
related match: http://thes.bncf.firenze.sbn.it/termine.php