ispezione degli alimenti di origine animale
type: Concept
broader: https://w3id.org/italia/controlled-vocabulary/classifications-for-culture/subject-disciplines/009
notation: 009.004
editorial note: Fonte: Decreto Ministeriale 4 ottobre 2000 [In rete] http://attiministeriali.miur.it/anno-2000/ottobre/dm-04102000.aspx (26 febbraio 2018)
has rank order: 2
definition: Il settore comprende le conoscenze e i temi di ricerca che riguardano gli aspetti del controllo sanitario degli alimenti di origine animale, freschi o conservati, e dell'igiene applicata alle produzioni alimentari, al fine di garantire la tutela della sanità pubblica, per mezzo dell'igiene e tecnologia alimentare, della microbiologia degli alimenti di origine animale, delle operazioni nei macelli, laboratori e industrie alimentari, dell'ispezione e certificazione degli alimenti di origine animale e delle metodologie e biotecnologie applicate alla produzione degli alimenti. Vengono anche approfonditi gli aspetti relativi al controllo di qualità degli alimenti in tutte le fasi delle diverse filiere produttive, dalle produzioni primarie al prodotto finito, ivi comprese le fasi di commercializzazione e somministrazione, anche in situazioni di emergenza, le basi necessarie per salvaguardare il benessere animale e la tutela ambientale, senza tralasciare gli aspetti socio- economici collegati alla produzione degli alimenti.
preferred label: inspection of foods of animal origin @en
in scheme: subject-disciplines