clinica medica veterinaria
type: Concept
notation: 009.009
editorial note: Fonte: Decreto Ministeriale 4 ottobre 2000 [In rete] http://attiministeriali.miur.it/anno-2000/ottobre/dm-04102000.aspx (26 febbraio 2018)
has rank order: 2
preferred label: clinical veterinary medicine @en
related match: http://thes.bncf.firenze.sbn.it/termine.php
in scheme: subject-disciplines
definition: Il settore raggruppa le tematiche che affrontano lo studio dell’eziopatogenesi, epidemiologia, sintomatologia, diagnosi, diagnosi differenziale e terapia delle patologie animali, le indagini cliniche dirette, laboratoristiche e strumentali, ivi compresa la diagnostica per immagini. Il settore comprende inoltre l’approfondimento delle conoscenze relative alle leggi ed ai regolamenti di competenza veterinaria, le norme di benessere e protezione animale, le responsabilità civili e penali e la deontologia del medico veterinario. Le competenze formative riguardano la clinica medica e la terapia medica, la diagnostica medica di laboratorio e l’immunologia clinica, la medicina legale e la legislazione veterinaria, la protezione animale e la deontologia, la patologia medica e la epidemiologia clinica, la radiologia, la diagnostica per immagini e l’endoscopia, la semeiotica medica e la metodologia clinica veterinaria.
broader: https://w3id.org/italia/controlled-vocabulary/classifications-for-culture/subject-disciplines/009