clinica ostetrica e ginecologia veterinaria
type: Concept
broader: https://w3id.org/italia/controlled-vocabulary/classifications-for-culture/subject-disciplines/009
notation: 009.011
editorial note: Fonte: Decreto Ministeriale 4 ottobre 2000 [In rete] http://attiministeriali.miur.it/anno-2000/ottobre/dm-04102000.aspx (26 febbraio 2018)
has rank order: 2
definition: Il settore raggruppa le tematiche di ricerca inerenti alla fisiopatologia della riproduzione delle femmine e dei maschi delle varie specie animali, anche in modo comparato, alla diagnostica e alla clinica delle lesioni e delle anomalie degli organi genitali, al controllo e al condizionamento del materiale gametico e degli embrioni, allo stato gravidico e al parto, e alle loro conseguenze fisiologiche e patologiche, al controllo di condizioni di ipofertilità, al condizionamento dei cicli sessuali e riproduttivi, alla diagnostica e alla profilassi, anche in relazione alle normative nazionali, comunitarie ed internazionali, nonché alle biotecnologie applicate alla riproduzione animale. Le competenze formative riguardano l’andrologia e clinica andrologica, la ginecologia e clinica ostetrica, l’igiene e la fisiopatologia della riproduzione animale e la fecondazione artificiale, le biotecnologie in riproduzione animale, la patologia e la tecnica della riproduzione nelle diverse specie animali.
preferred label: clinical veterinary obstetrics and gynecology @en
in scheme: subject-disciplines