idraulica
type: Concept
broader: 010
definition: I contenuti scientifico-disciplinari attengono alle problematiche della meccanica dei fluidi nell'ingegneria, con particolare riguardo a quelli debolmente comprimibili. L'attenzione è pertanto rivolta al moto dei fluidi e delle grandezze trasportate nei sistemi naturali (mare, laghi, fiumi, falde sotterranee) e nei sistemi artificiali (canalizzazioni, impianti, macchine, dispositivi); all'interazione dei fluidi con le superfici di contorno (ingegneria fluviale e costiera, idroelasticità, idraulica biologica); nonché, più in generale, alla previsione ed al controllo dei fenomeni connessi col moto dei fluidi. I metodi d'indagine sono le procedure sperimentali (misure di laboratorio, sugli impianti, di campagna) e la modellistica fisica e matematica.
editorial note: Fonte: Decreto Ministeriale 4 ottobre 2000 [In rete] http://attiministeriali.miur.it/anno-2000/ottobre/dm-04102000.aspx (26 febbraio 2018)
in scheme: subject-disciplines
notation: 010.001
preferred label: hydraulics @en
related match: http://thes.bncf.firenze.sbn.it/termine.php
has rank order: 2