ingegneria sanitaria-ambientale
type: Concept
editorial note: Fonte: Decreto Ministeriale 4 ottobre 2000 [In rete] http://attiministeriali.miur.it/anno-2000/ottobre/dm-04102000.aspx (26 febbraio 2018)
preferred label: sanitary and environmental engineering @en
definition: I contenuti scientifico-disciplinari investono aspetti ingegneristici nella tutela degli equilibri degli ecosistemi e nella prevenzione dell'inquinamento chimico, fisico e biologico. Includono studi sui cicli biologici, sulle alterazioni ecologiche, sulla dispersione ed il decadimento degli inquinanti nei corpi solidi porosi, liquidi e aeriformi, sulla ecotossicologia, sull'impatto ed il rischio ambientale. Si applicano alle tecnologie industriali pulite; al disinquinamento dell'aria; alla progettazione, valutazione d'impatto, costruzione, gestione delle opere e degli impianti per il trattamento e smaltimento dei rifiuti solidi e liquidi e degli effluenti gassosi civili e industriali e per la depurazione e potabilizzazione delle acque; alla reattoristica ed ai bioreattori; alle tecniche di bonifica dei siti contaminati; alla metrologia e la certificazione di qualità ambientali.
alternative label: ingegneria ambientale
alternative label: ingegneria sanitaria
has rank order: 2
broader: https://w3id.org/italia/controlled-vocabulary/classifications-for-culture/subject-disciplines/010
in scheme: subject-disciplines
notation: 010.005
related match: http://thes.bncf.firenze.sbn.it/termine.php