strade, ferrovie ed aeroporti
type: Concept
editorial note: Fonte: Decreto Ministeriale 4 ottobre 2000 [In rete] http://attiministeriali.miur.it/anno-2000/ottobre/dm-04102000.aspx (26 febbraio 2018)
broader: https://w3id.org/italia/controlled-vocabulary/classifications-for-culture/subject-disciplines/010
in scheme: subject-disciplines
alternative label: strade
definition: I contenuti scientifico-disciplinari riguardano le teorie e le tecniche rivolte alla concezione, progettazione, costruzione, adeguamento, gestione, manutenzione e controllo delle infrastrutture per i trasporti (stradali e ferroviarie incluse quelle in sotterraneo, aeroportuali e speciali), intese come un insieme integrato. Ciò in relazione funzionale alla domanda di trasporto, al fattore umano, alla sicurezza della circolazione, all'impatto sull'ambiente ed alla efficacia economica degli interventi. Coinvolgono anche le problematiche relative ai materiali stradali, alla stabilità ed all'analisi computazionale statica e dinamica del corpo stradale e delle sovrastrutture, agli impianti ed ai dispositivi complementari, alla qualità delle opere ed all'organizzazione e sicurezza dei cantieri.
notation: 010.006
alternative label: ferrovie
alternative label: aeroporti
preferred label: highways, railways and airports @en
has rank order: 2