scienza delle costruzioni
type: Concept
broader: 010
definition: I contenuti scientifico-disciplinari sono formati da argomenti di meccanica deterministica e stocastica dei solidi, dei materiali, delle strutture, che traducono problemi di base delle costruzioni concernenti la loro risposta alle azioni sollecitanti, la loro affidabilità e sicurezza, la loro ottimizzazione e che riguardano statica, dinamica, instabilità, frattura, collasso, controllo di modelli comportamentali volti a descrivere tale problematica. Coinvolgono per questi temi la modellazione fisico-matematica, la meccanica computazionale, l'analisi sperimentale, l'identificazione strutturale. Si estendono alla meccanica dell'interazione fra le strutture e l'ambiente fisico; alla meccanica di materiali e strutture non tradizionali; allo studio critico dello sviluppo storico dei modelli comportamentali in questione ed alla lettura in chiave strutturale di manufatti storici e monumenti.
editorial note: Fonte: Decreto Ministeriale 4 ottobre 2000 [In rete] http://attiministeriali.miur.it/anno-2000/ottobre/dm-04102000.aspx (26 febbraio 2018)
in scheme: subject-disciplines
notation: 010.011
preferred label: structural mechanics @en
related match: scienze e tecnologie delle costruzioni
related match: http://thes.bncf.firenze.sbn.it/termine.php
has rank order: 2